Information card for entry 4335641
Common name | beta-Methylammonium_Tin_Lead_Iodide |
Formula | C H3 I3 N Pb0.57 Sn0.43 |
Calculated formula | C I3 N Pb0.569 Sn0.431 |
Title of publication | Semiconducting Tin and Lead Iodide Perovskites with Organic Cations: Phase Transitions, High Mobilities, and Near-Infrared Photoluminescent Properties |
Authors of publication | Constantinos C. Stoumpos; Christos D. Malliakas; Mercouri G. Kanatzidis |
Journal of publication | Inorganic Chemistry |
Year of publication | 2013 |
Journal volume | 52 |
Pages of publication | 9019 - 9038 |
a | 8.8552 ± 0.0006 Å |
b | 8.8552 ± 0.0006 Å |
c | 12.5353 ± 0.0012 Å |
α | 90° |
β | 90° |
γ | 90° |
Cell volume | 982.95 ± 0.13 Å3 |
Cell temperature | 293 ± 2 K |
Ambient diffraction temperature | 293 ± 2 K |
Number of distinct elements | 6 |
Space group number | 108 |
Hermann-Mauguin space group symbol | I 4 c m |
Hall space group symbol | I 4 -2c |
Residual factor for all reflections | 0.0809 |
Residual factor for significantly intense reflections | 0.0678 |
Weighted residual factors for significantly intense reflections | 0.1732 |
Weighted residual factors for all reflections included in the refinement | 0.1809 |
Goodness-of-fit parameter for all reflections included in the refinement | 1.162 |
Diffraction radiation wavelength | 0.71073 Å |
Diffraction radiation type | MoKα |