Information card for entry 4335909
Formula | C22 H26 Hg2 I5 K O4 S |
Calculated formula | C22 H26 Hg2 I5 K O4 S |
Title of publication | Hard and Soft Metal Complexes of Calix[4]-bis-monothiacrown-5: X-ray and NMR Studies of Discrete Homodinuclear Complexes and a Heteromultinuclear Network |
Authors of publication | Ja-Yeon Kim; In-Hyeok Park; Jai Young Lee; Joon-Hwa Lee; Ki-Min Park; Shim Sung Lee |
Journal of publication | Inorganic Chemistry |
Year of publication | 2013 |
Journal volume | 52 |
Pages of publication | 10176 - 10182 |
a | 30.905 ± 0.0005 Å |
b | 15.0495 ± 0.0002 Å |
c | 13.8112 ± 0.0002 Å |
α | 90° |
β | 90° |
γ | 90° |
Cell volume | 6423.66 ± 0.16 Å3 |
Cell temperature | 173 ± 2 K |
Ambient diffraction temperature | 173 ± 2 K |
Number of distinct elements | 7 |
Space group number | 60 |
Hermann-Mauguin space group symbol | P b c n |
Hall space group symbol | -P 2n 2ab |
Residual factor for all reflections | 0.0485 |
Residual factor for significantly intense reflections | 0.0334 |
Weighted residual factors for significantly intense reflections | 0.0683 |
Weighted residual factors for all reflections included in the refinement | 0.0739 |
Goodness-of-fit parameter for all reflections included in the refinement | 1.05 |
Diffraction radiation wavelength | 0.71073 Å |
Diffraction radiation type | MoKα |