Information card for entry 4338692
Formula | C76 H92 Co2 N16 O12 |
Calculated formula | C76 H92 Co2 N16 O12 |
SMILES | Cc1cc(C)n2[n]1[Co]1([n]3c(cc(n3C2c2ccc(cc2)C(=O)O[Co]2([n]3c(C)cc(C)n3C(n3c(cc(C)[n]23)C)c2ccc(cc2)C(=O)O1)OC(=O)c1ccc(C(n2nc(C)cc2C)n2nc(cc2C)C)cc1)C)C)OC(=O)c1ccc(C(n2nc(C)cc2C)n2nc(cc2C)C)cc1.OC.CO.OC.OC |
Title of publication | Cobalt, zinc, and nickel complexes of a diatopic heteroscorpionate ligand: building blocks for coordination polymers. |
Authors of publication | Santillan, Guillermo A.; Carrano, Carl J. |
Journal of publication | Inorganic chemistry |
Year of publication | 2008 |
Journal volume | 47 |
Journal issue | 3 |
Pages of publication | 930 - 939 |
a | 14.6087 ± 0.0008 Å |
b | 19.2737 ± 0.0009 Å |
c | 14.9969 ± 0.0008 Å |
α | 90° |
β | 114.026 ± 0.002° |
γ | 90° |
Cell volume | 3856.7 ± 0.4 Å3 |
Cell temperature | 200 ± 2 K |
Ambient diffraction temperature | 200 ± 2 K |
Number of distinct elements | 5 |
Space group number | 14 |
Hermann-Mauguin space group symbol | P 1 21/n 1 |
Hall space group symbol | -P 2yn |
Residual factor for all reflections | 0.063 |
Residual factor for significantly intense reflections | 0.0423 |
Weighted residual factors for significantly intense reflections | 0.1114 |
Weighted residual factors for all reflections included in the refinement | 0.1209 |
Goodness-of-fit parameter for all reflections included in the refinement | 1.061 |
Diffraction radiation wavelength | 0.71073 Å |
Diffraction radiation type | MoKα |