Information card for entry 4338701
Formula | C49 H30 Cl2 N4 O4 Rh2 |
Calculated formula | C49 H30 Cl2 N4 O4 Rh2 |
Title of publication | Synthesis of N-confused tetraphenylporphyrin rhodium complexes having versatile metal oxidation states. |
Authors of publication | Srinivasan, Alagar; Toganoh, Motoki; Niino, Teppei; Osuka, Atsuhiro; Furuta, Hiroyuki |
Journal of publication | Inorganic chemistry |
Year of publication | 2008 |
Journal volume | 47 |
Journal issue | 23 |
Pages of publication | 11305 - 11313 |
a | 21.6955 ± 0.0016 Å |
b | 11.1778 ± 0.0007 Å |
c | 21.6 ± 0.0013 Å |
α | 90° |
β | 120.957 ± 0.003° |
γ | 90° |
Cell volume | 4492 ± 0.5 Å3 |
Cell temperature | 296 ± 2 K |
Ambient diffraction temperature | 296 ± 2 K |
Number of distinct elements | 6 |
Space group number | 15 |
Hermann-Mauguin space group symbol | C 1 2/c 1 |
Hall space group symbol | -C 2yc |
Residual factor for all reflections | 0.0642 |
Residual factor for significantly intense reflections | 0.0355 |
Weighted residual factors for significantly intense reflections | 0.0761 |
Weighted residual factors for all reflections included in the refinement | 0.0812 |
Goodness-of-fit parameter for all reflections included in the refinement | 0.967 |
Diffraction radiation wavelength | 0.71069 Å |
Diffraction radiation type | MoKα |