Information card for entry 4338703
Formula | C46 H34 I2 N4 O Rh |
Calculated formula | C46 H34 I2 N4 O Rh |
Title of publication | Synthesis of N-confused tetraphenylporphyrin rhodium complexes having versatile metal oxidation states. |
Authors of publication | Srinivasan, Alagar; Toganoh, Motoki; Niino, Teppei; Osuka, Atsuhiro; Furuta, Hiroyuki |
Journal of publication | Inorganic chemistry |
Year of publication | 2008 |
Journal volume | 47 |
Journal issue | 23 |
Pages of publication | 11305 - 11313 |
a | 9.1089 ± 0.0007 Å |
b | 11.3145 ± 0.0012 Å |
c | 11.7172 ± 0.0012 Å |
α | 64.512 ± 0.002° |
β | 86.478 ± 0.005° |
γ | 66.596 ± 0.004° |
Cell volume | 991.61 ± 0.17 Å3 |
Cell temperature | 123 ± 2 K |
Ambient diffraction temperature | 123 ± 2 K |
Number of distinct elements | 6 |
Space group number | 2 |
Hermann-Mauguin space group symbol | P -1 |
Hall space group symbol | -P 1 |
Residual factor for all reflections | 0.0409 |
Residual factor for significantly intense reflections | 0.0375 |
Weighted residual factors for significantly intense reflections | 0.0947 |
Weighted residual factors for all reflections included in the refinement | 0.0974 |
Goodness-of-fit parameter for all reflections included in the refinement | 1.073 |
Diffraction radiation wavelength | 0.71069 Å |
Diffraction radiation type | MoKα |