Information card for entry 4338848
Formula | C22 H48 N4 Ni O4 S2 |
Calculated formula | C22 H48 N4 Ni O4 S2 |
Title of publication | An experimental and computational study of sulfur-modified nucleophilicity in a dianionic NiN2S2 complex. |
Authors of publication | Green, Kayla N.; Brothers, Scott M.; Jenkins, Roxanne M.; Carson, Cody E.; Grapperhaus, Craig A.; Darensbourg, Marcetta Y. |
Journal of publication | Inorganic chemistry |
Year of publication | 2007 |
Journal volume | 46 |
Journal issue | 18 |
Pages of publication | 7536 - 7544 |
a | 10.1135 ± 0.0006 Å |
b | 10.1135 ± 0.0006 Å |
c | 52.752 ± 0.005 Å |
α | 90° |
β | 90° |
γ | 90° |
Cell volume | 5395.6 ± 0.7 Å3 |
Cell temperature | 110 ± 2 K |
Ambient diffraction temperature | 110 ± 2 K |
Number of distinct elements | 6 |
Space group number | 96 |
Hermann-Mauguin space group symbol | P 43 21 2 |
Hall space group symbol | P 4nw 2abw |
Residual factor for all reflections | 0.0642 |
Residual factor for significantly intense reflections | 0.0597 |
Weighted residual factors for significantly intense reflections | 0.1571 |
Weighted residual factors for all reflections included in the refinement | 0.1619 |
Goodness-of-fit parameter for all reflections included in the refinement | 1.04 |
Diffraction radiation wavelength | 0.71073 Å |
Diffraction radiation type | MoKα |