Information card for entry 4338896
Formula | C69 H72 F12 N6 O3 P2 Ti3 |
Calculated formula | C69 H72 F12 N6 O3 P2 Ti3 |
SMILES | [Ti]123456789([n]%10c%11c%12n1c1cc(c(cc1n1[Ti]%13%14%15%16%17%18%19%20([n]%21c(c%121)c1[n]([Ti]%12%22%23%24%25%26%27%28([n](c%111)c1cc(c(cc%101)C)C)([cH]1[cH]%12[cH]%22[cH]%23[cH]%241)[cH]1[cH]%28[cH]%27[cH]%26[cH]%251)c1c%21cc(c(c1)C)C)([cH]1[cH]%16[cH]%15[cH]%14[cH]%131)[cH]1[cH]%20[cH]%19[cH]%18[cH]%171)C)C)([cH]1[cH]5[cH]4[cH]3[cH]21)[cH]1[cH]9[cH]8[cH]7[cH]61.[P](F)(F)(F)(F)(F)[F-].[P](F)(F)(F)(F)(F)[F-].O=C(C)C.O=C(C)C.O=C(C)C |
Title of publication | Selective oxidation and reduction of trinuclear titanium(II) hexaazatrinaphthylene complexes-synthesis, structure, and electrochemical investigations. |
Authors of publication | Piglosiewicz, Ingmar M.; Beckhaus, Rüdiger; Wittstock, Gunther; Saak, Wolfgang; Haase, Detlef |
Journal of publication | Inorganic chemistry |
Year of publication | 2007 |
Journal volume | 46 |
Journal issue | 18 |
Pages of publication | 7610 - 7620 |
a | 16.3898 ± 0.0007 Å |
b | 14.8294 ± 0.0009 Å |
c | 28.2782 ± 0.0011 Å |
α | 90° |
β | 90.054 ± 0.005° |
γ | 90° |
Cell volume | 6873 ± 0.6 Å3 |
Cell temperature | 153 ± 2 K |
Ambient diffraction temperature | 153 ± 2 K |
Number of distinct elements | 7 |
Space group number | 14 |
Hermann-Mauguin space group symbol | P 1 21/n 1 |
Hall space group symbol | -P 2yn |
Residual factor for all reflections | 0.2606 |
Residual factor for significantly intense reflections | 0.1205 |
Weighted residual factors for significantly intense reflections | 0.2881 |
Weighted residual factors for all reflections included in the refinement | 0.3355 |
Goodness-of-fit parameter for all reflections included in the refinement | 0.922 |
Diffraction radiation wavelength | 0.71073 Å |
Diffraction radiation type | MoKα |