Information card for entry 4338938
Common name | cerium lutetium selenide |
Formula | Ce3 Lu Se6 |
Calculated formula | Ce3 Lu Se6 |
Title of publication | Syntheses, structures, magnetism, and optical properties of lutetium-based interlanthanide selenides. |
Authors of publication | Jin, Geng Bang; Choi, Eun Sang; Guertin, Robert P.; Brooks, James S.; Booth, Corwin H.; Albrecht-Schmitt, Thomas E |
Journal of publication | Inorganic chemistry |
Year of publication | 2007 |
Journal volume | 46 |
Journal issue | 22 |
Pages of publication | 9213 - 9220 |
a | 14.502 ± 0.0009 Å |
b | 17.4954 ± 0.0011 Å |
c | 4.1129 ± 0.0003 Å |
α | 90° |
β | 90° |
γ | 90° |
Cell volume | 1043.52 ± 0.12 Å3 |
Cell temperature | 193 ± 2 K |
Ambient diffraction temperature | 193 ± 2 K |
Number of distinct elements | 3 |
Space group number | 58 |
Hermann-Mauguin space group symbol | P n n m |
Hall space group symbol | -P 2 2n |
Residual factor for all reflections | 0.0234 |
Residual factor for significantly intense reflections | 0.0212 |
Weighted residual factors for significantly intense reflections | 0.0477 |
Weighted residual factors for all reflections included in the refinement | 0.0485 |
Goodness-of-fit parameter for all reflections included in the refinement | 1.086 |
Diffraction radiation wavelength | 0.71073 Å |
Diffraction radiation type | MoKα |