Information card for entry 4338961
Formula | C36 H25 Co2 N3 O7 |
Calculated formula | C36 H24 Co2 N3 O7 |
Title of publication | A novel helical double-layered cobalt(II)-organic framework with tetranuclear [Co4(mu3-OH)2] clusters linked by an unsymmetrical pyridylbenzoate ligand. |
Authors of publication | Luo, Junhua; Zhao, Yusheng; Xu, Hongwu; Kinnibrugh, Tiffany L.; Yang, Dali; Timofeeva, Tatiana V.; Daemen, Luke L.; Zhang, Jianzhong; Bao, Wei; Thompson, Joe D.; Currier, Robert P. |
Journal of publication | Inorganic chemistry |
Year of publication | 2007 |
Journal volume | 46 |
Journal issue | 22 |
Pages of publication | 9021 - 9023 |
a | 11.729 ± 0.003 Å |
b | 13.314 ± 0.003 Å |
c | 19.666 ± 0.004 Å |
α | 90° |
β | 98.902 ± 0.003° |
γ | 90° |
Cell volume | 3034 ± 1.2 Å3 |
Cell temperature | 273 ± 2 K |
Ambient diffraction temperature | 273 ± 2 K |
Number of distinct elements | 5 |
Space group number | 14 |
Hermann-Mauguin space group symbol | P 1 21/c 1 |
Hall space group symbol | -P 2ybc |
Residual factor for all reflections | 0.0311 |
Residual factor for significantly intense reflections | 0.0265 |
Weighted residual factors for significantly intense reflections | 0.0697 |
Weighted residual factors for all reflections included in the refinement | 0.071 |
Goodness-of-fit parameter for all reflections included in the refinement | 1.053 |
Diffraction radiation wavelength | 0.71073 Å |
Diffraction radiation type | MoKα |