Information card for entry 4339045
Formula | C42 H36.5 Co3 Gd2 N6 O33.25 |
Calculated formula | C42 H36.48 Co3 Gd2 N6 O33.25 |
Title of publication | Lanthanide(III)-cobalt(II) heterometallic coordination polymers with radical adsorption properties. |
Authors of publication | Zhao, Xiao-Qing; Zhao, Bin; Ma, Yue; Shi, Wei; Cheng, Peng; Jiang, Zong-Hui; Liao, Dai-Zheng; Yan, Shi-Ping |
Journal of publication | Inorganic chemistry |
Year of publication | 2007 |
Journal volume | 46 |
Journal issue | 15 |
Pages of publication | 5832 - 5834 |
a | 15.212 ± 0.001 Å |
b | 15.212 ± 0.001 Å |
c | 15.451 ± 0.002 Å |
α | 90° |
β | 90° |
γ | 120° |
Cell volume | 3096.4 ± 0.5 Å3 |
Cell temperature | 294 ± 2 K |
Ambient diffraction temperature | 294 ± 2 K |
Number of distinct elements | 6 |
Space group number | 192 |
Hermann-Mauguin space group symbol | P 6/m c c |
Hall space group symbol | -P 6 2c |
Residual factor for all reflections | 0.0398 |
Residual factor for significantly intense reflections | 0.0299 |
Weighted residual factors for significantly intense reflections | 0.1214 |
Weighted residual factors for all reflections included in the refinement | 0.1326 |
Goodness-of-fit parameter for all reflections included in the refinement | 1.038 |
Diffraction radiation wavelength | 0.71073 Å |
Diffraction radiation type | MoKα |