Information card for entry 4339101
Formula | C218 H162 Cl6 Fe6 Mn6 N48 O30 |
Calculated formula | C218 H146 Cl6 Fe6 Mn6 N48 O30 |
Title of publication | Substituent effect on formation of heterometallic molecular wheels: synthesis, crystal structure, and magnetic properties. |
Authors of publication | Ni, Zhong-Hai; Zhang, Li-Fang; Tangoulis, Vassilis; Wernsdorfer, Wolfgang; Cui, Ai-Li; Sato, Osamu; Kou, Hui-Zhong |
Journal of publication | Inorganic chemistry |
Year of publication | 2007 |
Journal volume | 46 |
Journal issue | 15 |
Pages of publication | 6029 - 6037 |
a | 13.712 ± 0.003 Å |
b | 20.604 ± 0.006 Å |
c | 20.674 ± 0.005 Å |
α | 81.703 ± 0.01° |
β | 76.112 ± 0.009° |
γ | 86.273 ± 0.01° |
Cell volume | 5608 ± 2 Å3 |
Cell temperature | 113 ± 2 K |
Ambient diffraction temperature | 113 ± 2 K |
Number of distinct elements | 7 |
Space group number | 2 |
Hermann-Mauguin space group symbol | P -1 |
Hall space group symbol | -P 1 |
Residual factor for all reflections | 0.102 |
Residual factor for significantly intense reflections | 0.0878 |
Weighted residual factors for significantly intense reflections | 0.2288 |
Weighted residual factors for all reflections included in the refinement | 0.2422 |
Goodness-of-fit parameter for all reflections included in the refinement | 1.1 |
Diffraction radiation wavelength | 0.7107 Å |
Diffraction radiation type | MoKα |