Information card for entry 4339174
Formula | C27 H22 F6 N10 O Pt2 |
Calculated formula | C27 H22 F6 N10 O Pt2 |
SMILES | [Pt]12([n]3n([Pt]4([n]5n1ccc5)[n]1ccccc1c1n4nc(c1)C(F)(F)F)ccc3)[n]1ccccc1c1n2nc(c1)C(F)(F)F.O=C(C)C |
Title of publication | Blue-emitting platinum(II) complexes bearing both pyridylpyrazolate chelate and bridging pyrazolate ligands: synthesis, structures, and photophysical properties. |
Authors of publication | Chang, Sheng-Yuan; Chen, Jing-Lin; Chi, Yun; Cheng, Yi-Ming; Lee, Gene-Hsiang; Jiang, Chang-Ming; Chou, Pi-Tai |
Journal of publication | Inorganic chemistry |
Year of publication | 2007 |
Journal volume | 46 |
Journal issue | 26 |
Pages of publication | 11202 - 11212 |
a | 17.4642 ± 0.001 Å |
b | 8.6594 ± 0.0005 Å |
c | 19.8926 ± 0.0011 Å |
α | 90° |
β | 103.644 ± 0.001° |
γ | 90° |
Cell volume | 2923.5 ± 0.3 Å3 |
Cell temperature | 150 ± 2 K |
Ambient diffraction temperature | 150 ± 2 K |
Number of distinct elements | 6 |
Space group number | 14 |
Hermann-Mauguin space group symbol | P 1 21/n 1 |
Hall space group symbol | -P 2yn |
Residual factor for all reflections | 0.0457 |
Residual factor for significantly intense reflections | 0.0347 |
Weighted residual factors for significantly intense reflections | 0.0758 |
Weighted residual factors for all reflections included in the refinement | 0.0895 |
Goodness-of-fit parameter for all reflections included in the refinement | 1.126 |
Diffraction radiation wavelength | 0.71073 Å |
Diffraction radiation type | MoKα |