Information card for entry 4339197
Formula | C25 H44 B Cl9 Cu3 N7 S3 W |
Calculated formula | C25 H44 B Cl9 Cu3 N7 S3 W |
Title of publication | Reactions of a tungsten trisulfido complex of hydridotris(3,5-dimethylpyrazol-1-yl)borate (Tp*) [Et(4)N][Tp*WS(3)] with CuX (X = Cl, NCS, or CN): isolation, structures, and third-order NLO properties. |
Authors of publication | Wang, Jing; Sun, Zhen-Rong; Deng, Li; Wei, Zheng-Hong; Zhang, Wen-Hua; Zhang, Yong; Lang, Jian-Ping |
Journal of publication | Inorganic chemistry |
Year of publication | 2007 |
Journal volume | 46 |
Journal issue | 26 |
Pages of publication | 11381 - 11389 |
a | 10.355 ± 0.002 Å |
b | 10.39 ± 0.002 Å |
c | 21.624 ± 0.004 Å |
α | 83.93 ± 0.03° |
β | 85.13 ± 0.03° |
γ | 75.46 ± 0.03° |
Cell volume | 2235.2 ± 0.8 Å3 |
Cell temperature | 223 ± 2 K |
Ambient diffraction temperature | 223 ± 2 K |
Number of distinct elements | 8 |
Space group number | 2 |
Hermann-Mauguin space group symbol | P -1 |
Hall space group symbol | -P 1 |
Residual factor for all reflections | 0.0895 |
Residual factor for significantly intense reflections | 0.0789 |
Weighted residual factors for significantly intense reflections | 0.205 |
Weighted residual factors for all reflections included in the refinement | 0.2128 |
Goodness-of-fit parameter for all reflections included in the refinement | 1.043 |
Diffraction radiation wavelength | 0.71073 Å |
Diffraction radiation type | MoKα |