Information card for entry 4339274
Formula | Lu12.713 Zn58.534 |
Calculated formula | Lu12.713 Zn58.536 |
Title of publication | Occupation waves the way you have never seen them: the orthorhombic quasicrystal approximants RE(13)Zn(58+)(delta) (RE = Ho, Er, Tm, and Lu). |
Authors of publication | Piao, Shuying; Lidin, Sven |
Journal of publication | Inorganic chemistry |
Year of publication | 2007 |
Journal volume | 46 |
Journal issue | 16 |
Pages of publication | 6452 - 6463 |
a | 24.4282 ± 0.0007 Å |
b | 14.1116 ± 0.0007 Å |
c | 13.9187 ± 0.0007 Å |
α | 90° |
β | 90° |
γ | 90° |
Cell volume | 4798.1 ± 0.4 Å3 |
Ambient diffraction temperature | 293 K |
Number of distinct elements | 2 |
Space group number | 33 |
Hermann-Mauguin space group symbol | P c 21 n |
Hall space group symbol | P -2n -2ac |
Residual factor for all reflections | 0.0733 |
Residual factor for significantly intense reflections | 0.0501 |
Weighted residual factors for significantly intense reflections | 0.0503 |
Weighted residual factors for all reflections included in the refinement | 0.0532 |
Goodness-of-fit parameter for significantly intense reflections | 2.27 |
Goodness-of-fit parameter for all reflections included in the refinement | 1.87 |
Diffraction radiation wavelength | 0.71069 Å |
Diffraction radiation type | MoKα |