Information card for entry 4339368
Formula | Ca4 Cu4 O112 Si2 W16 |
Calculated formula | Ca4 Cu4 O112 Si2 W16 |
Title of publication | Ferromagnetically coupled dimer of Cu(II)-substituted gamma-decatungstosilicate. |
Authors of publication | Liu, Hongsheng; Gómez-García, Carlos J; Peng, Jun; Feng, Yuhua; Su, Zhongmin; Sha, Jingquan; Wang, Lixia |
Journal of publication | Inorganic chemistry |
Year of publication | 2007 |
Journal volume | 46 |
Journal issue | 24 |
Pages of publication | 10041 - 10043 |
a | 10.9084 ± 0.0008 Å |
b | 13.1056 ± 0.001 Å |
c | 17.8439 ± 0.0014 Å |
α | 69.628 ± 0.001° |
β | 73.219 ± 0.001° |
γ | 88.869 ± 0.001° |
Cell volume | 2280.3 ± 0.3 Å3 |
Cell temperature | 193 ± 2 K |
Ambient diffraction temperature | 193 ± 2 K |
Number of distinct elements | 5 |
Space group number | 2 |
Hermann-Mauguin space group symbol | P -1 |
Hall space group symbol | -P 1 |
Residual factor for all reflections | 0.0755 |
Residual factor for significantly intense reflections | 0.0675 |
Weighted residual factors for significantly intense reflections | 0.1778 |
Weighted residual factors for all reflections included in the refinement | 0.1854 |
Goodness-of-fit parameter for all reflections included in the refinement | 1.1 |
Diffraction radiation wavelength | 0.71073 Å |
Diffraction radiation type | MoKα |