Information card for entry 4339444
Formula | C52 H56 F8 Mo8 N24 O34 Zn2 |
Calculated formula | C52 H56 F8 Mo8 N24 O34 Zn2 |
Title of publication | Syntheses and structures of organic-inorganic hybrid compounds based on metal-fluconazole coordination polymers and the beta-Mo8O26 anion. |
Authors of publication | Li, Shun-Li; Lan, Ya-Qian; Ma, Jian-Fang; Yang, Jin; Wang, Xiao-Hong; Su, Zhong-Min |
Journal of publication | Inorganic chemistry |
Year of publication | 2007 |
Journal volume | 46 |
Journal issue | 20 |
Pages of publication | 8283 - 8290 |
a | 10.571 ± 0.0006 Å |
b | 11.737 ± 0.0006 Å |
c | 16.614 ± 0.0009 Å |
α | 78.773 ± 0.002° |
β | 86.208 ± 0.003° |
γ | 82.351 ± 0.002° |
Cell volume | 2002.18 ± 0.19 Å3 |
Cell temperature | 293 ± 2 K |
Ambient diffraction temperature | 293 ± 2 K |
Number of distinct elements | 7 |
Space group number | 2 |
Hermann-Mauguin space group symbol | P -1 |
Hall space group symbol | -P 1 |
Residual factor for all reflections | 0.0306 |
Residual factor for significantly intense reflections | 0.0259 |
Weighted residual factors for significantly intense reflections | 0.0651 |
Weighted residual factors for all reflections included in the refinement | 0.0676 |
Goodness-of-fit parameter for all reflections included in the refinement | 1.019 |
Diffraction radiation wavelength | 0.71069 Å |
Diffraction radiation type | MoKα |