Information card for entry 4339476
Formula | C36 H60 Co3 Cr2 O42 |
Calculated formula | C36 H48 Co3 Cr2 O42 |
Title of publication | A "cation-less" oxalate-based ferromagnet formed by neutral bimetallic layers: {[Co(H2O)2]3[Cr(ox)3]2(18-crown-6)2}(infinity) (ox = oxalate dianion; 18-crown-6 = C12H24O6). |
Authors of publication | Coronado, Eugenio; Galan-Mascarós, José R; Martí-Gastaldo, Carlos |
Journal of publication | Inorganic chemistry |
Year of publication | 2007 |
Journal volume | 46 |
Journal issue | 20 |
Pages of publication | 8108 - 8110 |
a | 14.395 ± 0.0004 Å |
b | 15.65 ± 0.0005 Å |
c | 26.67 ± 0.001 Å |
α | 90° |
β | 90° |
γ | 90° |
Cell volume | 6008.3 ± 0.3 Å3 |
Cell temperature | 293 ± 2 K |
Ambient diffraction temperature | 293 ± 2 K |
Number of distinct elements | 5 |
Space group number | 33 |
Hermann-Mauguin space group symbol | P c 21 n |
Hall space group symbol | P -2n -2ac |
Residual factor for all reflections | 0.0887 |
Residual factor for significantly intense reflections | 0.0615 |
Weighted residual factors for significantly intense reflections | 0.1497 |
Weighted residual factors for all reflections included in the refinement | 0.1655 |
Goodness-of-fit parameter for all reflections included in the refinement | 0.96 |
Diffraction radiation wavelength | 0.71073 Å |
Diffraction radiation type | MoKα |