Information card for entry 4339504
Common name | [(CuCN)~2~(Ptz)] |
Chemical name | catena-poly[!mu-phthalazinedi-!mu-cyano-)dicopper(I)] |
Formula | C10 H6 Cu2 N4 |
Calculated formula | C10 H6 Cu2 N4 |
Title of publication | Copper(I) cyanide networks: synthesis, luminescence behavior and thermal analysis. Part 1. Diimine ligands. |
Authors of publication | Tronic, Tristan A.; deKrafft, Kathryn E; Lim, Mi Jung; Ley, Amanda N.; Pike, Robert D. |
Journal of publication | Inorganic chemistry |
Year of publication | 2007 |
Journal volume | 46 |
Journal issue | 21 |
Pages of publication | 8897 - 8912 |
a | 12.3183 ± 0.0002 Å |
b | 10.4748 ± 0.0002 Å |
c | 9.1013 ± 0.0002 Å |
α | 90° |
β | 116.854 ± 0.001° |
γ | 90° |
Cell volume | 1047.71 ± 0.04 Å3 |
Cell temperature | 100 ± 2 K |
Ambient diffraction temperature | 100 ± 2 K |
Number of distinct elements | 4 |
Space group number | 15 |
Hermann-Mauguin space group symbol | C 1 2/c 1 |
Hall space group symbol | -C 2yc |
Residual factor for all reflections | 0.022 |
Residual factor for significantly intense reflections | 0.0205 |
Weighted residual factors for significantly intense reflections | 0.0554 |
Weighted residual factors for all reflections included in the refinement | 0.0562 |
Goodness-of-fit parameter for all reflections included in the refinement | 1.164 |
Diffraction radiation wavelength | 1.54178 Å |
Diffraction radiation type | CuKα |