Information card for entry 4339517
Common name | 4-chlorophenyl mesylate |
Formula | C7 H7 Cl O3 S |
Calculated formula | C7 H7 Cl O3 S |
SMILES | c1(ccc(cc1)Cl)OS(=O)(=O)C |
Title of publication | Electronic structure of the sulfonyl and phosphonyl groups: a computational and crystallographic study. |
Authors of publication | Denehy, Emma; White, Jonathan M.; Williams, Spencer J. |
Journal of publication | Inorganic chemistry |
Year of publication | 2007 |
Journal volume | 46 |
Journal issue | 21 |
Pages of publication | 8871 - 8886 |
a | 10.7874 ± 0.0008 Å |
b | 7.8525 ± 0.0006 Å |
c | 11.301 ± 0.0008 Å |
α | 90° |
β | 117.831 ± 0.001° |
γ | 90° |
Cell volume | 846.56 ± 0.11 Å3 |
Cell temperature | 130 ± 2 K |
Ambient diffraction temperature | 130 ± 2 K |
Number of distinct elements | 5 |
Space group number | 14 |
Hermann-Mauguin space group symbol | P 1 21/n 1 |
Hall space group symbol | -P 2yn |
Residual factor for all reflections | 0.0289 |
Residual factor for significantly intense reflections | 0.0276 |
Weighted residual factors for significantly intense reflections | 0.0775 |
Weighted residual factors for all reflections included in the refinement | 0.0785 |
Goodness-of-fit parameter for all reflections included in the refinement | 1.121 |
Diffraction radiation wavelength | 0.71073 Å |
Diffraction radiation type | MoKα |