Information card for entry 4339738
Formula | C25 H16 N2 O7 Pr |
Calculated formula | C25 H16 N2 O7 Pr |
Title of publication | Porphyrin framework solids. Synthesis and structure of hybrid coordination polymers of tetra(carboxyphenyl)porphyrins and lanthanide-bridging ions. |
Authors of publication | Muniappan, Sankar; Lipstman, Sophia; George, Sumod; Goldberg, Israel |
Journal of publication | Inorganic chemistry |
Year of publication | 2007 |
Journal volume | 46 |
Journal issue | 14 |
Pages of publication | 5544 - 5554 |
a | 7.4595 ± 0.0001 Å |
b | 11.474 ± 0.0003 Å |
c | 16.4767 ± 0.0004 Å |
α | 98.9511 ± 0.0011° |
β | 90.9863 ± 0.0014° |
γ | 91.3109 ± 0.0014° |
Cell volume | 1392.4 ± 0.05 Å3 |
Cell temperature | 110 ± 2 K |
Ambient diffraction temperature | 110 ± 2 K |
Number of distinct elements | 5 |
Space group number | 2 |
Hermann-Mauguin space group symbol | P -1 |
Hall space group symbol | -P 1 |
Residual factor for all reflections | 0.0392 |
Residual factor for significantly intense reflections | 0.0348 |
Weighted residual factors for significantly intense reflections | 0.0984 |
Weighted residual factors for all reflections included in the refinement | 0.1008 |
Goodness-of-fit parameter for all reflections included in the refinement | 1.12 |
Diffraction radiation wavelength | 0.71073 Å |
Diffraction radiation type | MoKα |