Information card for entry 4339782
Formula | C17 H22.6 Cl2 Cu2 N8 O15.8 |
Calculated formula | C17 H13 Cl2 Cu2 N8 O15.8 |
Title of publication | Supramolecular self-assembled polynuclear complexes from tritopic, tetratopic, and pentatopic ligands: structural, magnetic and surface studies. |
Authors of publication | Dey, Subrata K.; Abedin, Tareque S. M.; Dawe, Louise N.; Tandon, Santokh S.; Collins, Julie L.; Thompson, Laurence K.; Postnikov, Andrei V.; Alam, Mohammad S.; Müller, Paul |
Journal of publication | Inorganic chemistry |
Year of publication | 2007 |
Journal volume | 46 |
Journal issue | 19 |
Pages of publication | 7767 - 7781 |
a | 8.1242 ± 0.0005 Å |
b | 20.8794 ± 0.0014 Å |
c | 8.3519 ± 0.0006 Å |
α | 90° |
β | 103.673 ± 0.001° |
γ | 90° |
Cell volume | 1376.57 ± 0.16 Å3 |
Cell temperature | 153 ± 2 K |
Ambient diffraction temperature | 153 ± 2 K |
Number of distinct elements | 6 |
Space group number | 4 |
Hermann-Mauguin space group symbol | P 1 21 1 |
Hall space group symbol | P 2yb |
Residual factor for all reflections | 0.0367 |
Residual factor for significantly intense reflections | 0.0363 |
Weighted residual factors for significantly intense reflections | 0.0961 |
Weighted residual factors for all reflections included in the refinement | 0.0966 |
Goodness-of-fit parameter for all reflections included in the refinement | 1.076 |
Diffraction radiation wavelength | 0.7107 Å |
Diffraction radiation type | MoKα |