Information card for entry 4339858
Formula | C24.5 H34 Mn2 N4 O9.5 |
Calculated formula | C24.5 H34 Mn2 N4 O9.5 |
Title of publication | Structure and properties of dinuclear manganese(III) complexes with pentaanionic pentadentate ligands including alkoxo, amido, and phenoxo donors. |
Authors of publication | Stoicescu, Liliana; Jeanson, Aurélie; Duhayon, Carine; Tesouro-Vallina, Ana; Boudalis, Athanassios K.; Costes, Jean-Pierre; Tuchagues, Jean-Pierre |
Journal of publication | Inorganic chemistry |
Year of publication | 2007 |
Journal volume | 46 |
Journal issue | 17 |
Pages of publication | 6902 - 6910 |
a | 12.205 ± 0.0007 Å |
b | 12.736 ± 0.0008 Å |
c | 19.278 ± 0.001 Å |
α | 99.735 ± 0.005° |
β | 96.003 ± 0.004° |
γ | 101.221 ± 0.005° |
Cell volume | 2867.6 ± 0.3 Å3 |
Cell temperature | 180 K |
Ambient diffraction temperature | 180 K |
Number of distinct elements | 5 |
Space group number | 2 |
Hermann-Mauguin space group symbol | P -1 |
Hall space group symbol | -P 1 |
Residual factor for all reflections | 0.0841 |
Residual factor for significantly intense reflections | 0.0519 |
Weighted residual factors for significantly intense reflections | 0.1285 |
Weighted residual factors for all reflections included in the refinement | 0.146 |
Goodness-of-fit parameter for all reflections included in the refinement | 0.983 |
Diffraction radiation probe | x-ray |
Diffraction radiation wavelength | 0.71073 Å |