Information card for entry 4339933
Formula | C39 H56 Cr N4 O1.5 |
Calculated formula | C39 H56 Cr N4 O1.5 |
Title of publication | Dinitrogen activation, partial reduction, and formation of coordinated imide promoted by a chromium diiminepyridine complex. |
Authors of publication | Vidyaratne, Indu; Scott, Jennifer; Gambarotta, Sandro; Budzelaar, Peter H. M. |
Journal of publication | Inorganic chemistry |
Year of publication | 2007 |
Journal volume | 46 |
Journal issue | 17 |
Pages of publication | 7040 - 7049 |
a | 25.143 ± 0.003 Å |
b | 11.5634 ± 0.0014 Å |
c | 30.241 ± 0.004 Å |
α | 90° |
β | 113.095 ± 0.002° |
γ | 90° |
Cell volume | 8087.6 ± 1.7 Å3 |
Cell temperature | 213 ± 2 K |
Ambient diffraction temperature | 213 ± 2 K |
Number of distinct elements | 5 |
Space group number | 15 |
Hermann-Mauguin space group symbol | C 1 2/c 1 |
Hall space group symbol | -C 2yc |
Residual factor for all reflections | 0.0838 |
Residual factor for significantly intense reflections | 0.0674 |
Weighted residual factors for significantly intense reflections | 0.1757 |
Weighted residual factors for all reflections included in the refinement | 0.187 |
Goodness-of-fit parameter for all reflections included in the refinement | 1.086 |
Diffraction radiation wavelength | 0.71073 Å |
Diffraction radiation type | MoKα |