Information card for entry 4341202
Formula | Ga4.964 Mo0.076 Ta3.942 |
Calculated formula | Ga4.964 Mo0.0756 Ta3.9424 |
Title of publication | Homoatomic Clustering in T4Ga5 (T = Ta, Nb, Ta/Mo): A Story of Reluctant Intermetallics Crystallizing in a New Binary Structure Type. |
Authors of publication | Fredrickson, Rie T.; Kilduff, Brandon J.; Fredrickson, Daniel C. |
Journal of publication | Inorganic chemistry |
Year of publication | 2015 |
Journal volume | 54 |
Journal issue | 3 |
Pages of publication | 821 - 831 |
a | 11.78 ± 0.0001 Å |
b | 11.78 ± 0.0001 Å |
c | 16.9547 ± 0.0002 Å |
α | 90° |
β | 90° |
γ | 90° |
Cell volume | 2352.78 ± 0.04 Å3 |
Cell temperature | 293 K |
Ambient diffraction temperature | 293 K |
Number of distinct elements | 3 |
Space group number | 136 |
Hermann-Mauguin space group symbol | P 42/m n m |
Hall space group symbol | -P 4n 2n |
Residual factor for all reflections | 0.0223 |
Residual factor for significantly intense reflections | 0.02 |
Weighted residual factors for significantly intense reflections | 0.0656 |
Weighted residual factors for all reflections included in the refinement | 0.0787 |
Goodness-of-fit parameter for significantly intense reflections | 2.29 |
Goodness-of-fit parameter for all reflections included in the refinement | 2.68 |
Diffraction radiation probe | x-ray |
Diffraction radiation wavelength | 0.71069 Å |
Diffraction radiation type | MoKα |