Information card for entry 4341658
Formula |
Al8 Ce Co2 |
Calculated formula |
Al8 Ce Co2 |
Title of publication |
Investigation of Mn, Fe, and Ni Incorporation in CeCo2Al8. |
Authors of publication |
Treadwell, LaRico J; Watkins-Curry, Pilanda; McAlpin, Jacob D.; Rebar, Drew J.; Hebert, Jessica K.; DiTusa, John F.; Chan, Julia Y. |
Journal of publication |
Inorganic chemistry |
Year of publication |
2015 |
Journal volume |
54 |
Journal issue |
3 |
Pages of publication |
963 - 968 |
a |
12.472 ± 0.001 Å |
b |
14.387 ± 0.0015 Å |
c |
4.022 ± 0.003 Å |
α |
90° |
β |
90° |
γ |
90° |
Cell volume |
721.7 ± 0.5 Å3 |
Cell temperature |
293 ± 2 K |
Ambient diffraction temperature |
293 ± 2 K |
Number of distinct elements |
3 |
Space group number |
55 |
Hermann-Mauguin space group symbol |
P b a m |
Hall space group symbol |
-P 2 2ab |
Residual factor for all reflections |
0.0314 |
Residual factor for significantly intense reflections |
0.0255 |
Weighted residual factors for significantly intense reflections |
0.056 |
Weighted residual factors for all reflections included in the refinement |
0.0592 |
Goodness-of-fit parameter for all reflections included in the refinement |
0.988 |
Diffraction radiation wavelength |
0.71073 Å |
Diffraction radiation type |
MoKα |
Yes |
No |
No |