Information card for entry 4341701
Common name | Ba2Ga8GeS16 |
Formula | Ba2 Ga8 Ge S16 |
Calculated formula | Ba2 Ga7.98 Ge1.02 S16 |
Title of publication | Syntheses, Structures, and Nonlinear-Optical Properties of Metal Sulfides Ba2Ga8MS16 (M = Si, Ge). |
Authors of publication | Liu, Bin-Wen; Zeng, Hui-Yi; Zhang, Ming-Jian; Fan, Yu-Hang; Guo, Guo-Cong; Huang, Jin-Shun; Dong, Zhen-Chao |
Journal of publication | Inorganic chemistry |
Year of publication | 2015 |
Journal volume | 54 |
Journal issue | 3 |
Pages of publication | 976 - 981 |
a | 10.8868 ± 0.0004 Å |
b | 10.8868 ± 0.0004 Å |
c | 11.9152 ± 0.0007 Å |
α | 90° |
β | 90° |
γ | 120° |
Cell volume | 1223.02 ± 0.1 Å3 |
Cell temperature | 293 ± 2 K |
Ambient diffraction temperature | 293 ± 2 K |
Number of distinct elements | 4 |
Space group number | 186 |
Hermann-Mauguin space group symbol | P 63 m c |
Hall space group symbol | P 6c -2c |
Residual factor for all reflections | 0.0164 |
Residual factor for significantly intense reflections | 0.015 |
Weighted residual factors for significantly intense reflections | 0.0272 |
Weighted residual factors for all reflections included in the refinement | 0.028 |
Goodness-of-fit parameter for all reflections included in the refinement | 1.039 |
Diffraction radiation wavelength | 0.71073 Å |
Diffraction radiation type | MoKα |