Information card for entry 4341741
Formula | Cl Cs Fe3 Na2 O14 P4 |
Calculated formula | Cl Cs Fe3 Na2 O14 P4 |
Title of publication | M3(P2O7)2(2-)-Type Open Frameworks Featuring [M2O8] and [M3O12] Multinuclear Transition-Metal Oxide Units. Serendipitous Synthesis of Six Polymorphic Salt-Inclusion Magnetic Solids: Na2M3(P2O7)2·ACl (M = Mn, Fe; A = Rb, Cs) and K2M3(P2O7)2·CsCl (M = Fe, Mn). |
Authors of publication | Gao, Jianhua; Li, Jian; Sulejmanovic, Dino; Hwu, Shiou-Jyh |
Journal of publication | Inorganic chemistry |
Year of publication | 2015 |
Journal volume | 54 |
Journal issue | 3 |
Pages of publication | 1136 - 1144 |
a | 20.884 ± 0.007 Å |
b | 5.228 ± 0.007 Å |
c | 13.76 ± 0.02 Å |
α | 90° |
β | 118.44° |
γ | 90° |
Cell volume | 1321 ± 3 Å3 |
Cell temperature | 273 ± 2 K |
Ambient diffraction temperature | 273 ± 2 K |
Number of distinct elements | 6 |
Space group number | 15 |
Hermann-Mauguin space group symbol | C 1 2/c 1 |
Hall space group symbol | -C 2yc |
Residual factor for all reflections | 0.0241 |
Residual factor for significantly intense reflections | 0.0235 |
Weighted residual factors for significantly intense reflections | 0.0627 |
Weighted residual factors for all reflections included in the refinement | 0.0633 |
Goodness-of-fit parameter for all reflections included in the refinement | 1.084 |
Diffraction radiation wavelength | 0.71073 Å |
Diffraction radiation type | MoKα |