Information card for entry 4341743
Formula | Cl Cs K2 Mn3 O14 P4 |
Calculated formula | Cl Cs K2 Mn3 O14 P4 |
Title of publication | M3(P2O7)2(2-)-Type Open Frameworks Featuring [M2O8] and [M3O12] Multinuclear Transition-Metal Oxide Units. Serendipitous Synthesis of Six Polymorphic Salt-Inclusion Magnetic Solids: Na2M3(P2O7)2·ACl (M = Mn, Fe; A = Rb, Cs) and K2M3(P2O7)2·CsCl (M = Fe, Mn). |
Authors of publication | Gao, Jianhua; Li, Jian; Sulejmanovic, Dino; Hwu, Shiou-Jyh |
Journal of publication | Inorganic chemistry |
Year of publication | 2015 |
Journal volume | 54 |
Journal issue | 3 |
Pages of publication | 1136 - 1144 |
a | 7.6288 ± 0.0015 Å |
b | 5.3699 ± 0.0011 Å |
c | 18.995 ± 0.004 Å |
α | 90° |
β | 100.92 ± 0.03° |
γ | 90° |
Cell volume | 764.1 ± 0.3 Å3 |
Cell temperature | 293 ± 2 K |
Ambient diffraction temperature | 293 ± 2 K |
Number of distinct elements | 6 |
Space group number | 13 |
Hermann-Mauguin space group symbol | P 1 2/c 1 |
Hall space group symbol | -P 2yc |
Residual factor for all reflections | 0.0313 |
Residual factor for significantly intense reflections | 0.0304 |
Weighted residual factors for significantly intense reflections | 0.0787 |
Weighted residual factors for all reflections included in the refinement | 0.0796 |
Goodness-of-fit parameter for all reflections included in the refinement | 1.115 |
Diffraction radiation wavelength | 0.71073 Å |
Diffraction radiation type | MoKα |