Information card for entry 4341860
Formula | C95 H82 Au4 F12 O P8 |
Calculated formula | C95 H82 Au4 F12 O P8 |
Title of publication | Tetragold(I) Complexes: Solution Isomerization and Tunable Solid-State Luminescence. |
Authors of publication | Dau, Thuy Minh; Chen, Yi-An; Karttunen, Antti J.; Grachova, Elena V.; Tunik, Sergey P.; Lin, Ke-Ting; Hung, Wen-Yi; Chou, Pi-Tai; Pakkanen, Tapani A.; Koshevoy, Igor O. |
Journal of publication | Inorganic chemistry |
Year of publication | 2014 |
Pages of publication | 141201154356007 |
a | 12.3155 ± 0.0004 Å |
b | 12.2783 ± 0.0005 Å |
c | 30.2738 ± 0.001 Å |
α | 90° |
β | 100.096 ± 0.002° |
γ | 90° |
Cell volume | 4506.9 ± 0.3 Å3 |
Cell temperature | 120 ± 2 K |
Ambient diffraction temperature | 120 ± 2 K |
Number of distinct elements | 6 |
Space group number | 14 |
Hermann-Mauguin space group symbol | P 1 21/c 1 |
Hall space group symbol | -P 2ybc |
Residual factor for all reflections | 0.0553 |
Residual factor for significantly intense reflections | 0.0317 |
Weighted residual factors for significantly intense reflections | 0.0682 |
Weighted residual factors for all reflections included in the refinement | 0.0753 |
Goodness-of-fit parameter for all reflections included in the refinement | 1.03 |
Diffraction radiation wavelength | 0.71073 Å |
Diffraction radiation type | MoKα |