Information card for entry 4341912
Formula | C32 H20 F6 Ir N4 |
Calculated formula | C32 H20 F6 Ir N4 |
Title of publication | N-Heterocyclic Carbenes: Versatile Second Cyclometalated Ligands for Neutral Iridium(III) Heteroleptic Complexes. |
Authors of publication | Li, Tian-Yi; Liang, Xiao; Zhou, Liang; Wu, Chen; Zhang, Song; Liu, Xuan; Lu, Guang-Zhao; Xue, Li-Sha; Zheng, You-Xuan; Zuo, Jing-Lin |
Journal of publication | Inorganic chemistry |
Year of publication | 2015 |
Journal volume | 54 |
Journal issue | 1 |
Pages of publication | 161 - 173 |
a | 17.6274 ± 0.0003 Å |
b | 17.6274 ± 0.0003 Å |
c | 34.4966 ± 0.0005 Å |
α | 90° |
β | 90° |
γ | 90° |
Cell volume | 10719 ± 0.3 Å3 |
Cell temperature | 291 ± 2 K |
Ambient diffraction temperature | 291 ± 2 K |
Number of distinct elements | 5 |
Space group number | 142 |
Hermann-Mauguin space group symbol | I 41/a c d :2 |
Hall space group symbol | -I 4bd 2c |
Residual factor for all reflections | 0.0501 |
Residual factor for significantly intense reflections | 0.0429 |
Weighted residual factors for significantly intense reflections | 0.1001 |
Weighted residual factors for all reflections included in the refinement | 0.1011 |
Goodness-of-fit parameter for all reflections included in the refinement | 1.054 |
Diffraction radiation wavelength | 0.71073 Å |
Diffraction radiation type | MoKα |