Information card for entry 4341943
Formula | C46 H34 Al2 F12 N4 O8 S4 |
Calculated formula | C46 H34 Al2 F12 N4 O8 S4 |
SMILES | c12ccccc1sc1C=C(O[Al]34([n]21)([OH][Al]12([n]5c6ccccc6sc5C=C(O1)C(F)(F)F)([n]1c5ccccc5sc1C=C(O2)C(F)(F)F)[OH]4)[n]1c2ccccc2sc1C=C(O3)C(F)(F)F)C(F)(F)F.O=C(C)C.O=C(C)C |
Title of publication | Ligand-Modulated Chemical and Structural Implications in Four-, Five-, and Six-fold Coordinated Aluminum Heteroaryl Alkenolates. |
Authors of publication | Czympiel, Lisa; Pfrommer, Johannes; Tyrra, Wieland; Schäfer, Mathias; Mathur, Sanjay |
Journal of publication | Inorganic chemistry |
Year of publication | 2015 |
Journal volume | 54 |
Journal issue | 1 |
Pages of publication | 25 - 37 |
a | 15.3683 ± 0.0018 Å |
b | 14.4592 ± 0.0018 Å |
c | 23.252 ± 0.002 Å |
α | 90° |
β | 90° |
γ | 90° |
Cell volume | 5166.9 ± 1 Å3 |
Cell temperature | 293 ± 2 K |
Ambient diffraction temperature | 293 ± 2 K |
Number of distinct elements | 7 |
Space group number | 60 |
Hermann-Mauguin space group symbol | P b c n |
Hall space group symbol | -P 2n 2ab |
Residual factor for all reflections | 0.1842 |
Residual factor for significantly intense reflections | 0.071 |
Weighted residual factors for significantly intense reflections | 0.1347 |
Weighted residual factors for all reflections included in the refinement | 0.1697 |
Goodness-of-fit parameter for all reflections included in the refinement | 0.922 |
Diffraction radiation wavelength | 0.71073 Å |
Diffraction radiation type | MoKα |