Information card for entry 4341951
Formula | C31 H27.6 Co N6 O1.8 S2 |
Calculated formula | C31 H26.5 Co N6 O1.25 S2 |
Title of publication | Two-Dimensional Coordination Polymers Constructed Using, Simultaneously, Linear and Angular Spacers and Cobalt(II) Nodes. New Examples of Networks of Single-Ion Magnets. |
Authors of publication | Ion, Adrian E.; Nica, Simona; Madalan, Augustin M.; Shova, Sergiu; Vallejo, Julia; Julve, Miguel; Lloret, Francesc; Andruh, Marius |
Journal of publication | Inorganic chemistry |
Year of publication | 2015 |
Journal volume | 54 |
Journal issue | 1 |
Pages of publication | 16 - 18 |
a | 18.6325 ± 0.0018 Å |
b | 19.481 ± 0.0013 Å |
c | 10.404 ± 0.003 Å |
α | 90° |
β | 94.787 ± 0.013° |
γ | 90° |
Cell volume | 3763.3 ± 1.2 Å3 |
Cell temperature | 293 ± 2 K |
Ambient diffraction temperature | 293 ± 2 K |
Number of distinct elements | 6 |
Space group number | 14 |
Hermann-Mauguin space group symbol | P 1 21/c 1 |
Hall space group symbol | -P 2ybc |
Residual factor for all reflections | 0.1654 |
Residual factor for significantly intense reflections | 0.0768 |
Weighted residual factors for significantly intense reflections | 0.1686 |
Weighted residual factors for all reflections included in the refinement | 0.2168 |
Goodness-of-fit parameter for all reflections included in the refinement | 0.982 |
Diffraction radiation wavelength | 0.71073 Å |
Diffraction radiation type | MoKα |