Information card for entry 4341957
Formula | C16 H11 Dy N2 O5 |
Calculated formula | C16 H11 Dy N2 O5 |
Title of publication | Three Isostructural One-Dimensional Ln(III) Chains with Distorted Cubane Motifs Showing Dual Fluorescence and Slow Magnetic Relaxation/Magnetocaloric Effect. |
Authors of publication | Li, Yan; Yu, Jia-Wen; Liu, Zhong-Yi; Yang, En-Cui; Zhao, Xiao-Jun |
Journal of publication | Inorganic chemistry |
Year of publication | 2015 |
Journal volume | 54 |
Journal issue | 1 |
Pages of publication | 153 - 160 |
a | 18.9363 ± 0.0012 Å |
b | 18.9363 ± 0.0012 Å |
c | 8.2997 ± 0.001 Å |
α | 90° |
β | 90° |
γ | 90° |
Cell volume | 2976.1 ± 0.4 Å3 |
Cell temperature | 173 ± 2 K |
Ambient diffraction temperature | 173 ± 2 K |
Number of distinct elements | 5 |
Space group number | 82 |
Hermann-Mauguin space group symbol | I -4 |
Hall space group symbol | I -4 |
Residual factor for all reflections | 0.0246 |
Residual factor for significantly intense reflections | 0.0235 |
Weighted residual factors for significantly intense reflections | 0.044 |
Weighted residual factors for all reflections included in the refinement | 0.0445 |
Goodness-of-fit parameter for all reflections included in the refinement | 1.05 |
Diffraction radiation wavelength | 0.71073 Å |
Diffraction radiation type | MoKα |