Information card for entry 4342000
Formula | C26 H32 Cl4 Ga2 N4 |
Calculated formula | C26 H32 Cl4 Ga2 N4 |
SMILES | [Ga]123N4C5=CC=CC=CC5=[N]1CCCCCC[N]2=C1C=CC=CC=C1N3CCCCCC4.[Ga]([Cl-])(Cl)(Cl)Cl |
Title of publication | Synthesis and Characterization of Mononuclear, Pseudotetrahedral Cobalt(III) Compounds. |
Authors of publication | Kozhukh, Julia; Minier, Mikael A.; Lippard, Stephen J. |
Journal of publication | Inorganic chemistry |
Year of publication | 2015 |
Journal volume | 54 |
Journal issue | 2 |
Pages of publication | 418 - 424 |
a | 21.986 ± 0.0015 Å |
b | 21.986 ± 0.0015 Å |
c | 11.9576 ± 0.0008 Å |
α | 90° |
β | 90° |
γ | 120° |
Cell volume | 5005.7 ± 0.6 Å3 |
Cell temperature | 100 ± 2 K |
Ambient diffraction temperature | 100 ± 2 K |
Number of distinct elements | 5 |
Space group number | 170 |
Hermann-Mauguin space group symbol | P 65 |
Hall space group symbol | P 65 |
Residual factor for all reflections | 0.0545 |
Residual factor for significantly intense reflections | 0.0418 |
Weighted residual factors for significantly intense reflections | 0.0813 |
Weighted residual factors for all reflections included in the refinement | 0.0845 |
Goodness-of-fit parameter for all reflections included in the refinement | 1.022 |
Diffraction radiation wavelength | 0.71073 Å |
Diffraction radiation type | MoKα |