Information card for entry 4342076
Formula | C89 H110 Cd2 N Na O24 |
Calculated formula | C89 H56 Cd2 N Na O24 |
Title of publication | Metal-Ion Exchange, Small-Molecule Sensing, Selective Dye Adsorption, and Reversible Iodine Uptake of Three Coordination Polymers Constructed by a New Resorcin[4]arene-Based Tetracarboxylate. |
Authors of publication | Lv, Li Li; Yang, Jin; Zhang, Hong-Mei; Liu, Ying-Ying; Ma, Jian-Fang |
Journal of publication | Inorganic chemistry |
Year of publication | 2015 |
Journal volume | 54 |
Journal issue | 4 |
Pages of publication | 1744 - 1755 |
a | 43.009 ± 0.002 Å |
b | 9.6038 ± 0.0004 Å |
c | 25.0691 ± 0.0011 Å |
α | 90° |
β | 105.365 ± 0.005° |
γ | 90° |
Cell volume | 9984.7 ± 0.8 Å3 |
Cell temperature | 293 ± 2 K |
Ambient diffraction temperature | 293 ± 2 K |
Number of distinct elements | 6 |
Space group number | 9 |
Hermann-Mauguin space group symbol | C 1 c 1 |
Hall space group symbol | C -2yc |
Residual factor for all reflections | 0.1914 |
Residual factor for significantly intense reflections | 0.0964 |
Weighted residual factors for significantly intense reflections | 0.2159 |
Weighted residual factors for all reflections included in the refinement | 0.2814 |
Goodness-of-fit parameter for all reflections included in the refinement | 1.017 |
Diffraction radiation wavelength | 0.71073 Å |
Diffraction radiation type | MoKα |