Information card for entry 4342101
Formula | H33 Mo10 O54 P V2 |
Calculated formula | Mo10.0116 O54 P V1.9884 |
Title of publication | Solid-State Crystal-to-Crystal Phase Transitions and Reversible Structure-Temperature Behavior of Phosphovanadomolybdic Acid, H5PV2Mo10O40. |
Authors of publication | Barats-Damatov, Delina; Shimon, Linda J. W.; Feldman, Yishay; Bendikov, Tatyana; Neumann, Ronny |
Journal of publication | Inorganic chemistry |
Year of publication | 2015 |
Journal volume | 54 |
Journal issue | 2 |
Pages of publication | 628 - 634 |
a | 13.4705 ± 0.0002 Å |
b | 13.962 ± 0.0002 Å |
c | 13.9967 ± 0.0001 Å |
α | 60.8204 ± 0.0008° |
β | 67.8345 ± 0.0008° |
γ | 70.315 ± 0.0007° |
Cell volume | 2090.11 ± 0.05 Å3 |
Cell temperature | 120 ± 2 K |
Ambient diffraction temperature | 120 ± 2 K |
Number of distinct elements | 5 |
Space group number | 2 |
Hermann-Mauguin space group symbol | P -1 |
Hall space group symbol | -P 1 |
Residual factor for all reflections | 0.092 |
Residual factor for significantly intense reflections | 0.0689 |
Weighted residual factors for significantly intense reflections | 0.1817 |
Weighted residual factors for all reflections included in the refinement | 0.2044 |
Goodness-of-fit parameter for all reflections included in the refinement | 1.125 |
Diffraction radiation wavelength | 0.71073 Å |
Diffraction radiation type | MoKα |