Information card for entry 4342103
Formula | C5 H16 N2 O10 Te2 V2 |
Calculated formula | C5 H16 N2 O10 Te2 V2 |
Title of publication | Role of noncovalent interactions in vanadium tellurite chain connectivities. |
Authors of publication | Nourmahnad, Anahita; Smith, Matthew D.; Zeller, Matthias; Ferrence, Gregory M.; Schrier, Joshua; Norquist, Alexander J. |
Journal of publication | Inorganic chemistry |
Year of publication | 2015 |
Journal volume | 54 |
Journal issue | 2 |
Pages of publication | 694 - 703 |
a | 7.5506 ± 0.0003 Å |
b | 8.9255 ± 0.0004 Å |
c | 11.4699 ± 0.0005 Å |
α | 93.4986 ± 0.0016° |
β | 93.7112 ± 0.0015° |
γ | 96.8662 ± 0.0015° |
Cell volume | 763.99 ± 0.06 Å3 |
Cell temperature | 100 K |
Ambient diffraction temperature | 100 K |
Number of distinct elements | 6 |
Space group number | 2 |
Hermann-Mauguin space group symbol | P -1 |
Hall space group symbol | -P 1 |
Residual factor for all reflections | 0.0133 |
Residual factor for significantly intense reflections | 0.0128 |
Weighted residual factors for all reflections | 0.0382 |
Weighted residual factors for significantly intense reflections | 0.0378 |
Weighted residual factors for all reflections included in the refinement | 0.0375 |
Goodness-of-fit parameter for all reflections included in the refinement | 1.0138 |
Diffraction radiation wavelength | 0.71073 Å |
Diffraction radiation type | MoKα |