Information card for entry 4342113
Chemical name | 2,6-Bis(indazol-1-yl)pyridine |
Formula | C19 H13 N5 |
Calculated formula | C19 H13 N5 |
SMILES | n1c(cccc1n1ncc2ccccc12)n1ncc2ccccc12 |
Title of publication | Iron(II) Complexes of Tridentate Indazolylpyridine Ligands: Enhanced Spin-Crossover Hysteresis and Ligand-Based Fluorescence. |
Authors of publication | Santoro, Amedeo; Kershaw Cook, Laurence J.; Kulmaczewski, Rafal; Barrett, Simon A.; Cespedes, Oscar; Halcrow, Malcolm A. |
Journal of publication | Inorganic chemistry |
Year of publication | 2015 |
Journal volume | 54 |
Journal issue | 2 |
Pages of publication | 682 - 693 |
a | 18.4345 ± 0.0008 Å |
b | 3.7854 ± 0.0001 Å |
c | 22.0008 ± 0.0008 Å |
α | 90° |
β | 108.418 ± 0.004° |
γ | 90° |
Cell volume | 1456.62 ± 0.1 Å3 |
Cell temperature | 120 ± 2 K |
Ambient diffraction temperature | 120 ± 2 K |
Number of distinct elements | 3 |
Space group number | 14 |
Hermann-Mauguin space group symbol | P 1 21/c 1 |
Hall space group symbol | -P 2ybc |
Residual factor for all reflections | 0.0798 |
Residual factor for significantly intense reflections | 0.0583 |
Weighted residual factors for significantly intense reflections | 0.1451 |
Weighted residual factors for all reflections included in the refinement | 0.1649 |
Goodness-of-fit parameter for all reflections included in the refinement | 1.059 |
Diffraction radiation wavelength | 1.54184 Å |
Diffraction radiation type | CuKα |