Information card for entry 4342115
Chemical name | 2,6-Bis(indazol-2-yl)pyridine |
Formula | C19 H13 N5 |
Calculated formula | C19 H13 N5 |
SMILES | n1c(cccc1n1nc2ccccc2c1)n1nc2ccccc2c1 |
Title of publication | Iron(II) Complexes of Tridentate Indazolylpyridine Ligands: Enhanced Spin-Crossover Hysteresis and Ligand-Based Fluorescence. |
Authors of publication | Santoro, Amedeo; Kershaw Cook, Laurence J.; Kulmaczewski, Rafal; Barrett, Simon A.; Cespedes, Oscar; Halcrow, Malcolm A. |
Journal of publication | Inorganic chemistry |
Year of publication | 2015 |
Journal volume | 54 |
Journal issue | 2 |
Pages of publication | 682 - 693 |
a | 6.9133 ± 0.0004 Å |
b | 11.8194 ± 0.0006 Å |
c | 19.3165 ± 0.0011 Å |
α | 104.009 ± 0.005° |
β | 96.68 ± 0.004° |
γ | 105.467 ± 0.005° |
Cell volume | 1448.09 ± 0.15 Å3 |
Cell temperature | 120 ± 2 K |
Ambient diffraction temperature | 120 ± 2 K |
Number of distinct elements | 3 |
Space group number | 2 |
Hermann-Mauguin space group symbol | P -1 |
Hall space group symbol | -P 1 |
Residual factor for all reflections | 0.0775 |
Residual factor for significantly intense reflections | 0.0525 |
Weighted residual factors for significantly intense reflections | 0.1267 |
Weighted residual factors for all reflections included in the refinement | 0.1443 |
Goodness-of-fit parameter for all reflections included in the refinement | 1.028 |
Diffraction radiation wavelength | 1.54184 Å |
Diffraction radiation type | CuKα |