Information card for entry 4342118
Chemical name | 2-Fluoro-6-(indazol-2-yl)pyridine - form 2 |
Formula | C12 H8 F N3 |
Calculated formula | C12 H8 F N3 |
SMILES | n1c(cccc1F)n1nc2ccccc2c1 |
Title of publication | Iron(II) Complexes of Tridentate Indazolylpyridine Ligands: Enhanced Spin-Crossover Hysteresis and Ligand-Based Fluorescence. |
Authors of publication | Santoro, Amedeo; Kershaw Cook, Laurence J.; Kulmaczewski, Rafal; Barrett, Simon A.; Cespedes, Oscar; Halcrow, Malcolm A. |
Journal of publication | Inorganic chemistry |
Year of publication | 2015 |
Journal volume | 54 |
Journal issue | 2 |
Pages of publication | 682 - 693 |
a | 31.6009 ± 0.0006 Å |
b | 5.6407 ± 0.0001 Å |
c | 11.5087 ± 0.0002 Å |
α | 90° |
β | 110.969 ± 0.002° |
γ | 90° |
Cell volume | 1915.58 ± 0.07 Å3 |
Cell temperature | 120 ± 2 K |
Ambient diffraction temperature | 120 ± 2 K |
Number of distinct elements | 4 |
Space group number | 15 |
Hermann-Mauguin space group symbol | C 1 2/c 1 |
Hall space group symbol | -C 2yc |
Residual factor for all reflections | 0.0363 |
Residual factor for significantly intense reflections | 0.035 |
Weighted residual factors for significantly intense reflections | 0.0905 |
Weighted residual factors for all reflections included in the refinement | 0.0919 |
Goodness-of-fit parameter for all reflections included in the refinement | 1.066 |
Diffraction radiation wavelength | 1.54184 Å |
Diffraction radiation type | CuKα |