Information card for entry 4342124
Chemical name | Bis[2,6-di(indazol-2-yl)pyridine]iron(II) diperchlorate chloroform solvate |
Formula | C39 H27 Cl5 Fe N10 O8 |
Calculated formula | C38.5 H26.5 Cl3.5 Fe N10 O8 |
Title of publication | Iron(II) Complexes of Tridentate Indazolylpyridine Ligands: Enhanced Spin-Crossover Hysteresis and Ligand-Based Fluorescence. |
Authors of publication | Santoro, Amedeo; Kershaw Cook, Laurence J.; Kulmaczewski, Rafal; Barrett, Simon A.; Cespedes, Oscar; Halcrow, Malcolm A. |
Journal of publication | Inorganic chemistry |
Year of publication | 2015 |
Journal volume | 54 |
Journal issue | 2 |
Pages of publication | 682 - 693 |
a | 12.765 ± 0.0005 Å |
b | 13.0619 ± 0.0005 Å |
c | 14.2126 ± 0.0006 Å |
α | 88.085 ± 0.003° |
β | 65.731 ± 0.004° |
γ | 81.623 ± 0.003° |
Cell volume | 2136.35 ± 0.16 Å3 |
Cell temperature | 340 ± 2 K |
Ambient diffraction temperature | 340 ± 2 K |
Number of distinct elements | 6 |
Space group number | 2 |
Hermann-Mauguin space group symbol | P -1 |
Hall space group symbol | -P 1 |
Residual factor for all reflections | 0.1197 |
Residual factor for significantly intense reflections | 0.0848 |
Weighted residual factors for significantly intense reflections | 0.2506 |
Weighted residual factors for all reflections included in the refinement | 0.2856 |
Goodness-of-fit parameter for all reflections included in the refinement | 1.018 |
Diffraction radiation wavelength | 1.54184 Å |
Diffraction radiation type | CuKα |