Information card for entry 4342139
Common name | Cs2, Hg (O Te F5)4,Hg (O Te F5)2 |
Formula | Cs F15 Hg O3 Te3 |
Calculated formula | Cs F15 Hg O3 Te3 |
Title of publication | Pentafluoro-oxotellurate(VI) Anions of Mercury(II); Syntheses and Structures of [Hg(OTeF5)4](2-), [Hg(OTeF5)5](3-), [Hg2(OTeF5)6](2-), [Hg(OTeF5)4](2-)·Hg(OTeF5)2, and [Hg2(OTeF5)7](3-)·Hg(OTeF5)2. |
Authors of publication | DeBackere, John R.; Mercier, Hélène P A; Schrobilgen, Gary J. |
Journal of publication | Inorganic chemistry |
Year of publication | 2015 |
Journal volume | 54 |
Journal issue | 4 |
Pages of publication | 1606 - 1626 |
a | 22.6115 ± 0.0003 Å |
b | 10.934 ± 0.0002 Å |
c | 15.2294 ± 0.0004 Å |
α | 90° |
β | 125.797 ± 0.001° |
γ | 90° |
Cell volume | 3053.96 ± 0.11 Å3 |
Cell temperature | 100 ± 2 K |
Ambient diffraction temperature | 100 ± 2 K |
Number of distinct elements | 5 |
Space group number | 15 |
Hermann-Mauguin space group symbol | C 1 2/c 1 |
Hall space group symbol | -C 2yc |
Residual factor for all reflections | 0.0257 |
Residual factor for significantly intense reflections | 0.0209 |
Weighted residual factors for significantly intense reflections | 0.0409 |
Weighted residual factors for all reflections included in the refinement | 0.0422 |
Goodness-of-fit parameter for all reflections included in the refinement | 1.088 |
Diffraction radiation wavelength | 0.71073 Å |
Diffraction radiation type | MoKα |