Information card for entry 4342145
Formula | C81 H104 Ga8 N16 |
Calculated formula | C81 H104 Ga8 N16 |
Title of publication | Insertion of benzonitrile into Al-N and ga-N bonds: formation of fused carbatriaza-gallanes/alanes and their subsequent synthesis from amidines and trimethyl-gallium/aluminum. |
Authors of publication | Maheswari, K.; Rao, A. Ramakrishna; Reddy, N. Dastagiri |
Journal of publication | Inorganic chemistry |
Year of publication | 2015 |
Journal volume | 54 |
Journal issue | 4 |
Pages of publication | 2000 - 2008 |
a | 13.0751 ± 0.0006 Å |
b | 13.6722 ± 0.0006 Å |
c | 14.7834 ± 0.0006 Å |
α | 71.83 ± 0.004° |
β | 65.638 ± 0.004° |
γ | 62.669 ± 0.005° |
Cell volume | 2114.07 ± 0.19 Å3 |
Cell temperature | 140 ± 2 K |
Ambient diffraction temperature | 140 ± 2 K |
Number of distinct elements | 4 |
Space group number | 2 |
Hermann-Mauguin space group symbol | P -1 |
Hall space group symbol | -P 1 |
Residual factor for all reflections | 0.0924 |
Residual factor for significantly intense reflections | 0.0514 |
Weighted residual factors for significantly intense reflections | 0.1093 |
Weighted residual factors for all reflections included in the refinement | 0.1292 |
Goodness-of-fit parameter for all reflections included in the refinement | 1.016 |
Diffraction radiation wavelength | 0.71073 Å |
Diffraction radiation type | MoKα |