Information card for entry 4342159
Formula | C20 H20 Co N4 O5 |
Calculated formula | C20 H20 Co N4 O5 |
Title of publication | Porous supramolecular networks constructed of one-dimensional metal-organic chains: carbon dioxide and iodine capture. |
Authors of publication | Yu, Fei; Li, Dan-Dan; Cheng, Lin; Yin, Zheng; Zeng, Ming-Hua; Kurmoo, Mohamedally |
Journal of publication | Inorganic chemistry |
Year of publication | 2015 |
Journal volume | 54 |
Journal issue | 4 |
Pages of publication | 1655 - 1660 |
a | 14.0279 ± 0.0003 Å |
b | 8.1674 ± 0.0003 Å |
c | 18.7317 ± 0.0005 Å |
α | 90° |
β | 94.3 ± 0.002° |
γ | 90° |
Cell volume | 2140.08 ± 0.11 Å3 |
Cell temperature | 298 ± 2 K |
Ambient diffraction temperature | 298 ± 2 K |
Number of distinct elements | 5 |
Space group number | 14 |
Hermann-Mauguin space group symbol | P 1 21/n 1 |
Hall space group symbol | -P 2yn |
Residual factor for all reflections | 0.0598 |
Residual factor for significantly intense reflections | 0.0504 |
Weighted residual factors for significantly intense reflections | 0.1503 |
Weighted residual factors for all reflections included in the refinement | 0.159 |
Goodness-of-fit parameter for all reflections included in the refinement | 1.043 |
Diffraction radiation wavelength | 0.71073 Å |
Diffraction radiation type | MoKα |