Information card for entry 4342161
Formula | C41 H26 Br2 Fe N4 Ni O3 S10 |
Calculated formula | C41 H26 Br2 Fe N4 Ni O3 S10 |
Title of publication | Thermal Hysteresis in a Spin-Crossover Fe(III) Quinolylsalicylaldimine Complex, Fe(III)(5-Br-qsal)2Ni(dmit)2·solv: Solvent Effects. |
Authors of publication | Vieira, Bruno J. C.; Dias, João C; Santos, Isabel C.; Pereira, Laura C. J.; da Gama, Vasco; Waerenborgh, João C |
Journal of publication | Inorganic chemistry |
Year of publication | 2015 |
Journal volume | 54 |
Journal issue | 4 |
Pages of publication | 1354 - 1362 |
a | 12.7802 ± 0.0008 Å |
b | 12.7915 ± 0.001 Å |
c | 15.7153 ± 0.0013 Å |
α | 71.671 ± 0.002° |
β | 82.983 ± 0.002° |
γ | 68.112 ± 0.002° |
Cell volume | 2262.9 ± 0.3 Å3 |
Cell temperature | 294 ± 2 K |
Ambient diffraction temperature | 294 ± 2 K |
Number of distinct elements | 8 |
Space group number | 2 |
Hermann-Mauguin space group symbol | P -1 |
Hall space group symbol | -P 1 |
Residual factor for all reflections | 0.1088 |
Residual factor for significantly intense reflections | 0.049 |
Weighted residual factors for significantly intense reflections | 0.0865 |
Weighted residual factors for all reflections included in the refinement | 0.0999 |
Goodness-of-fit parameter for all reflections included in the refinement | 0.909 |
Diffraction radiation wavelength | 0.71069 Å |
Diffraction radiation type | MoKα |