Information card for entry 4342166
Formula | C27 H38 La1.5 N13.5 O19 |
Calculated formula | C27 H27 La1.5 N13.5 O19 |
Title of publication | Lanthanide(III) Complexation with an Amide Derived Pyridinophane. |
Authors of publication | Castro, Goretti; Bastida, Rufina; Macías, Alejandro; Pérez-Lourido, Paulo; Platas-Iglesias, Carlos; Valencia, Laura |
Journal of publication | Inorganic chemistry |
Year of publication | 2015 |
Journal volume | 54 |
Journal issue | 4 |
Pages of publication | 1671 - 1683 |
a | 12.823 ± 0.0015 Å |
b | 12.9297 ± 0.0015 Å |
c | 13.6859 ± 0.0016 Å |
α | 106.508 ± 0.002° |
β | 110.376 ± 0.002° |
γ | 91.085 ± 0.002° |
Cell volume | 2021.8 ± 0.4 Å3 |
Cell temperature | 293 ± 2 K |
Ambient diffraction temperature | 293 ± 2 K |
Number of distinct elements | 5 |
Space group number | 2 |
Hermann-Mauguin space group symbol | P -1 |
Hall space group symbol | -P 1 |
Residual factor for all reflections | 0.0993 |
Residual factor for significantly intense reflections | 0.0569 |
Weighted residual factors for significantly intense reflections | 0.1443 |
Weighted residual factors for all reflections included in the refinement | 0.1751 |
Goodness-of-fit parameter for all reflections included in the refinement | 1.005 |
Diffraction radiation wavelength | 0.71073 Å |
Diffraction radiation type | MoKα |