Information card for entry 4342180
Formula | C24 H31 Co2 N O15 |
Calculated formula | C24 H29 Co2 N O15 |
Title of publication | Solvent templates induced porous metal-organic materials: conformational isomerism and catalytic activity. |
Authors of publication | Ding, Ran; Huang, Chao; Lu, Jingjing; Wang, Junning; Song, Chuanjun; Wu, Jie; Hou, Hongwei; Fan, Yaoting |
Journal of publication | Inorganic chemistry |
Year of publication | 2015 |
Journal volume | 54 |
Journal issue | 4 |
Pages of publication | 1405 - 1413 |
a | 7.772 ± 0.0016 Å |
b | 18.629 ± 0.004 Å |
c | 19.518 ± 0.005 Å |
α | 90° |
β | 104.23 ± 0.03° |
γ | 90° |
Cell volume | 2739.2 ± 1.1 Å3 |
Cell temperature | 293 ± 2 K |
Ambient diffraction temperature | 293 ± 2 K |
Number of distinct elements | 5 |
Space group number | 14 |
Hermann-Mauguin space group symbol | P 1 21/c 1 |
Hall space group symbol | -P 2ybc |
Residual factor for all reflections | 0.0816 |
Residual factor for significantly intense reflections | 0.072 |
Weighted residual factors for significantly intense reflections | 0.1932 |
Weighted residual factors for all reflections included in the refinement | 0.2003 |
Goodness-of-fit parameter for all reflections included in the refinement | 1.133 |
Diffraction radiation wavelength | 0.71073 Å |
Diffraction radiation type | MoKα |