Information card for entry 4342189
Formula | C28 H34 Cu2 N20 |
Calculated formula | C28 H34 Cu2 N20 |
Title of publication | Syntheses, Structural, Magnetic, and Electron Paramagnetic Resonance Studies of Monobridged Cyanide and Azide Dinuclear Copper(II) Complexes: Antiferromagnetic Superexchange Interactions. |
Authors of publication | Reger, Daniel L.; Pascui, Andrea E.; Smith, Mark D.; Jezierska, Julia; Ozarowski, Andrew |
Journal of publication | Inorganic chemistry |
Year of publication | 2015 |
Journal volume | 54 |
Journal issue | 4 |
Pages of publication | 1487 - 1500 |
a | 23.0409 ± 0.0012 Å |
b | 8.7757 ± 0.0005 Å |
c | 19.4868 ± 0.001 Å |
α | 90° |
β | 118.285 ± 0.001° |
γ | 90° |
Cell volume | 3469.8 ± 0.3 Å3 |
Cell temperature | 100 ± 2 K |
Ambient diffraction temperature | 100 ± 2 K |
Number of distinct elements | 4 |
Space group number | 15 |
Hermann-Mauguin space group symbol | C 1 2/c 1 |
Hall space group symbol | -C 2yc |
Residual factor for all reflections | 0.0458 |
Residual factor for significantly intense reflections | 0.0366 |
Weighted residual factors for significantly intense reflections | 0.0901 |
Weighted residual factors for all reflections included in the refinement | 0.0955 |
Goodness-of-fit parameter for all reflections included in the refinement | 1.05 |
Diffraction radiation wavelength | 0.71073 Å |
Diffraction radiation type | MoKα |