Information card for entry 4342200
Formula | C35 H29 F12 N9 P2 Ru |
Calculated formula | C35 H29 F12 N9 P2 Ru |
SMILES | c1cccc2c3cccc[n]3[Ru]34([n]12)([n]1ccccc1c1cccc[n]31)[n]1ccccc1c1c[n+](c2ccccc2)nn41.CC#N.[P](F)(F)(F)(F)(F)[F-].[P](F)(F)(F)(F)(F)[F-] |
Title of publication | Comparison of Inverse and Regular 2-Pyridyl-1,2,3-triazole "Click" Complexes: Structures, Stability, Electrochemical, and Photophysical Properties. |
Authors of publication | Lo, Warrick K. C.; Huff, Gregory S.; Cubanski, John R.; Kennedy, Aaron D. W.; McAdam, C. John; McMorran, David A.; Gordon, Keith C.; Crowley, James D. |
Journal of publication | Inorganic chemistry |
Year of publication | 2015 |
Journal volume | 54 |
Journal issue | 4 |
Pages of publication | 1572 - 1587 |
a | 11.469 ± 0.0014 Å |
b | 25.503 ± 0.004 Å |
c | 13.5621 ± 0.0012 Å |
α | 90° |
β | 99.473 ± 0.012° |
γ | 90° |
Cell volume | 3912.7 ± 0.9 Å3 |
Cell temperature | 100 ± 0.1 K |
Ambient diffraction temperature | 100 ± 0.1 K |
Number of distinct elements | 6 |
Space group number | 14 |
Hermann-Mauguin space group symbol | P 1 21/n 1 |
Hall space group symbol | -P 2yn |
Residual factor for all reflections | 0.1675 |
Residual factor for significantly intense reflections | 0.105 |
Weighted residual factors for significantly intense reflections | 0.2291 |
Weighted residual factors for all reflections included in the refinement | 0.2539 |
Goodness-of-fit parameter for all reflections included in the refinement | 1.088 |
Diffraction radiation wavelength | 1.5418 Å |
Diffraction radiation type | CuKα |