Information card for entry 4342214
Common name | red-dimer-Pt(DECO) |
Chemical name | Pt(II) cis-(bis[2-oximino-2-cyano-N,N'-diethylacetamide]) |
Formula | C14 H20 N6 O4 Pt |
Calculated formula | C14 H20 N6 O4 Pt |
Title of publication | 1D Polymeric Platinum Cyanoximate: A Strategy toward Luminescence in the Near-Infrared Region beyond 1000 nm. |
Authors of publication | Klaus, Danielle R.; Keene, Matthew; Silchenko, Svitlana; Berezin, Mikhail; Gerasimchuk, Nikolay |
Journal of publication | Inorganic chemistry |
Year of publication | 2015 |
Journal volume | 54 |
Journal issue | 4 |
Pages of publication | 1890 - 1900 |
a | 27.0687 ± 0.0018 Å |
b | 9.1876 ± 0.0006 Å |
c | 14.3089 ± 0.001 Å |
α | 90° |
β | 102.96 ± 0.001° |
γ | 90° |
Cell volume | 3467.9 ± 0.4 Å3 |
Cell temperature | 120 ± 2 K |
Ambient diffraction temperature | 120 ± 2 K |
Number of distinct elements | 5 |
Space group number | 15 |
Hermann-Mauguin space group symbol | C 1 2/c 1 |
Hall space group symbol | -C 2yc |
Residual factor for all reflections | 0.0375 |
Residual factor for significantly intense reflections | 0.0258 |
Weighted residual factors for significantly intense reflections | 0.0446 |
Weighted residual factors for all reflections included in the refinement | 0.0496 |
Goodness-of-fit parameter for all reflections included in the refinement | 1.115 |
Diffraction radiation wavelength | 0.71073 Å |
Diffraction radiation type | MoKα |